Target
Cell division protein FtsZ
Ligand
BDBM50086124
Substrate
Meas. Tech.
ChEMBL_1477924 (CHEMBL3429345)
IC50
27000±n/a nM
Citation
 Nepomuceno, GMChan, KMHuynh, VMartin, KSMoore, JTO'Brien, TEPollo, LASarabia, FJTadeus, CYao, ZAnderson, DEAmes, JBShaw, JT Synthesis and Evaluation of Quinazolines as Inhibitors of the Bacterial Cell Division Protein FtsZ. ACS Med Chem Lett 6:308-12 (2015)  
Target
Name:
Cell division protein FtsZ
Synonyms:
FTSZ_ECOLI sfiB | sulB
Type:
Protein
Mol. Mass.:
40305.83
Organism:
Escherichia coli
Description:
P0A9A6
Residue:
383
  
Inhibitor
Name:
BDBM50086124
Synonyms:
CHEMBL3425693
Type:
Small organic molecule
Emp. Form.:
C21H20ClF3N4O2
Mol. Mass.:
452.857
SMILES:
[O-]C(=O)C(F)(F)F.Cc1ccc2nc(\C=C\c3ccc(Cl)cc3)nc(NCC[NH3+])c2c1
: