Target
Laforin
Ligand
BDBM50087856
Substrate
Meas. Tech.
ChEMBL_1476067 (CHEMBL3428697)
pH
7±n/a
IC50
10300±n/a nM
Comments
extracted
Citation
 He, YGuo, XYu, ZHWu, LGunawan, AMZhang, YDixon, JEZhang, ZY A potent and selective inhibitor for the UBLCP1 proteasome phosphatase. Bioorg Med Chem 23:2798-809 (2015)  
Target
Name:
Laforin
Synonyms:
EPM2A LAFPTPase Laforin
Type:
Protein
Mol. Mass.:
37158.16
Organism:
Homo sapiens (Human)
Description:
O95278
Residue:
331
  
Inhibitor
Name:
BDBM50087856
Synonyms:
CHEMBL3426913
Type:
Small organic molecule
Emp. Form.:
C28H30F3NO6
Mol. Mass.:
533.5361
SMILES:
CCCCC(Oc1cc(O)c(cc1C#Cc1ccccc1OC(F)(F)F)C(O)=O)C(=O)NC1CCCCC1
: