Target
Histamine H3 receptor
Ligand
BDBM50088139
Substrate
Meas. Tech.
ChEMBL_1476599 (CHEMBL3428418)
IC50
1.1±n/a nM
Citation
 Blass, B Biphenyl-ethyl-pyrrolidine derivatives as histamine h3 receptor modulators for the treatment of cognitive disorders. ACS Med Chem Lett 6:235-6 (2015)  
Target
Name:
Histamine H3 receptor
Synonyms:
G-protein coupled receptor 97 HH3R HRH3 Histamine H3 receptor (H3) Histamine receptor (H3 and H4)
Type:
G Protein-Coupled Receptor (GPCR)
Mol. Mass.:
48691.47
Organism:
Homo sapiens (Human)
Description:
Binding assays were using CHO cells stably expressing hH3R receptors.
Residue:
445
  
Inhibitor
Name:
BDBM50088139
Synonyms:
CHEMBL3427232 | US9365511, 9
Type:
Small organic molecule
Emp. Form.:
C23H29NO2
Mol. Mass.:
351.4819
SMILES:
COC(=O)CCc1ccc(cc1)-c1ccc(CCN2CCC[C@H]2C)cc1
: