Target
Voltage-dependent L-type calcium channel subunit alpha-1C
Ligand
BDBM35229
Substrate
Meas. Tech.
ChEMBL_1479092 (CHEMBL3436068)
IC50
11700±n/a nM
Citation
 Wisniowska, BMendyk, AFijorek, KGlinka, APolak, S Predictive model for L-type channel inhibition: multichannel block in QT prolongation risk assessment. J Appl Toxicol 32:858-66 (2012)  
Target
Name:
Voltage-dependent L-type calcium channel subunit alpha-1C
Synonyms:
CAC1C_RAT Cacn2 Cacnl1a1 Calcium channel (Type L) Calcium channel, L type, alpha-1 polypeptide, isoform 1, cardiac muscle RBC Voltage-dependent L-type calcium channel subunit alpha-1C Voltage-gated L-type calcium channel alpha-1C subunit | Voltage-gated calcium channel subunit alpha Cav1.2
Type:
Enzyme Catalytic Domain
Mol. Mass.:
243492.26
Organism:
RAT
Description:
Calcium channel 0 RAT::P22002
Residue:
2169
  
Inhibitor
Name:
BDBM35229
Synonyms:
3-(10,11-dihydro-5H-dibenzo[b,f]azepin-5-yl)-N-methylpropan-1-amine CHEMBL72 DMI Desipramine N-(3-methylaminopropyl)iminobibenzyl demethylimipramine norimipramine
Type:
Small organic molecule
Emp. Form.:
C18H22N2
Mol. Mass.:
266.3807
SMILES:
CNCCCN1c2ccccc2CCc2ccccc12
: