Target
Voltage-dependent L-type calcium channel subunit alpha-1C
Ligand
BDBM50165019
Substrate
Meas. Tech.
ChEMBL_1479139 (CHEMBL3436115)
IC50
16100±n/a nM
Citation
 Wisniowska, BMendyk, AFijorek, KGlinka, APolak, S Predictive model for L-type channel inhibition: multichannel block in QT prolongation risk assessment. J Appl Toxicol 32:858-66 (2012)  
Target
Name:
Voltage-dependent L-type calcium channel subunit alpha-1C
Synonyms:
CAC1C_CAVPO CACH2 CACNA1C CCHL1A1 Voltage-dependent L-type calcium channel subunit alpha-1C | Voltage-gated calcium channel subunit alpha Cav1.2
Type:
PROTEIN
Mol. Mass.:
19518.62
Organism:
Cavia porcellus
Description:
ChEMBL_106600
Residue:
169
  
Inhibitor
Name:
BDBM50165019
Synonyms:
4-(Diethylamino)-2-butynyl alpha-phenylcyclohexaneglycolic acid ester 4-Diethylamino-2-butinyl alpha-cyclohexylmandelat Benzeneacetic acid, alpha-cyclohexyl-alpha-hydroxy-, 4-(diethylamino)-2-butynyl ester Cyclohexaneglycolic acid, alpha-phenyl-, 4-(diethylamino)-2-butynyl ester | OXYBUTYNIN CHLORIDE
Type:
Small organic molecule
Emp. Form.:
C22H31NO3
Mol. Mass.:
357.4864
SMILES:
CCN(CC)CC#CCOC(=O)C(O)(C1CCCCC1)c1ccccc1
: