Target
Bile salt export pump
Ligand
BDBM50103518
Substrate
Meas. Tech.
ChEMBL_1481883 (CHEMBL3540574)
IC50
>1000000±n/a nM
Citation
 Dawson, SStahl, SPaul, NBarber, JKenna, JG In vitro inhibition of the bile salt export pump correlates with risk of cholestatic drug-induced liver injury in humans. Drug Metab Dispos 40:130-8 (2011)  
Target
Name:
Bile salt export pump
Synonyms:
ABCBB_RAT Abcb11 Bile salt export pump Sister of P-glycoprotein | Spgp
Type:
PROTEIN
Mol. Mass.:
146267.86
Organism:
Rattus norvegicus
Description:
ChEMBL_1481883
Residue:
1321
  
Inhibitor
Name:
BDBM50103518
Synonyms:
Aciclovir Acyclovir Cyclovir | Zovirax
Type:
Small organic molecule
Emp. Form.:
C8H11N5O3
Mol. Mass.:
225.2046
SMILES:
Nc1nc(O)c2ncn(COCCO)c2n1
: