Target
Bile salt export pump
Ligand
BDBM50391000
Substrate
Meas. Tech.
ChEMBL_1481883 (CHEMBL3540574)
IC50
3100±n/a nM
Citation
 Dawson, SStahl, SPaul, NBarber, JKenna, JG In vitro inhibition of the bile salt export pump correlates with risk of cholestatic drug-induced liver injury in humans. Drug Metab Dispos 40:130-8 (2011)  
Target
Name:
Bile salt export pump
Synonyms:
ABCBB_RAT Abcb11 Bile salt export pump Sister of P-glycoprotein | Spgp
Type:
PROTEIN
Mol. Mass.:
146267.86
Organism:
Rattus norvegicus
Description:
ChEMBL_1481883
Residue:
1321
  
Inhibitor
Name:
BDBM50391000
Synonyms:
CB-01-11 | RIFAMYCIN
Type:
Small organic molecule
Emp. Form.:
C37H47NO12
Mol. Mass.:
697.7686
SMILES:
CO[C@H]1\C=C\O[C@@]2(C)Oc3c(C2=O)c2c(O)cc(NC(=O)\C(C)=C/C=C/[C@H](C)[C@H](O)[C@@H](C)[C@@H](O)[C@@H](C)[C@H](OC(C)=O)[C@@H]1C)c(O)c2c(O)c3C
: