Target
Cytochrome P450 2A6
Ligand
BDBM50062551
Substrate
Meas. Tech.
ChEMBL_1481818 (CHEMBL3539939)
IC50
>100000±n/a nM
Citation
 Reese, MJSavina, PMGeneraux, GTTracey, HHumphreys, JEKanaoka, EWebster, LOHarmon, KAClarke, JDPolli, JW In vitro investigations into the roles of drug transporters and metabolizing enzymes in the disposition and drug interactions of dolutegravir, a HIV integrase inhibitor. Drug Metab Dispos 41:353-61 (2013)  
Target
Name:
Cytochrome P450 2A6
Synonyms:
1,4-cineole 2-exo-monooxygenase CP2A6_HUMAN CYP2A6 Coumarin 7-hydroxylase Cytochrome P450 IIA3 | Cytochrome P450(I)
Type:
Protein
Mol. Mass.:
56514.34
Organism:
Homo sapiens (Human)
Description:
P11509
Residue:
494
  
Inhibitor
Name:
BDBM50062551
Synonyms:
CHEBI:76010 GSK1349572 | S-349572
Type:
Small organic molecule
Emp. Form.:
C20H19F2N3O5
Mol. Mass.:
419.3788
SMILES:
[H][C@]12Cn3cc(C(=O)NCc4ccc(F)cc4F)c(=O)c(O)c3C(=O)N1[C@H](C)CCO2
: