Target
Nuclear receptor subfamily 1 group I member 2
Ligand
BDBM50103631
Substrate
Meas. Tech.
ChEMBL_1487568 (CHEMBL3531874)
EC50
400±n/a nM
Citation
 Shukla, SJSakamuru, SHuang, RMoeller, TAShinn, PVanleer, DAuld, DSAustin, CPXia, M Identification of clinically used drugs that activate pregnane X receptors. Drug Metab Dispos 39:151-9 (2010)  
Target
Name:
Nuclear receptor subfamily 1 group I member 2
Synonyms:
NR1I2_RAT Nuclear receptor subfamily 1 group I member 2 Pregnane X receptor | Pxr
Type:
PROTEIN
Mol. Mass.:
49664.53
Organism:
Rattus norvegicus
Description:
ChEMBL_105143
Residue:
431
  
Inhibitor
Name:
BDBM50103631
Synonyms:
CHEBI:31625 Fluorometholone Oxylone
Type:
Small organic molecule
Emp. Form.:
C22H29FO4
Mol. Mass.:
376.4617
SMILES:
[H][C@@]12CC[C@](O)(C(C)=O)[C@@]1(C)C[C@H](O)[C@@]1(F)[C@@]2([H])C[C@H](C)C2=CC(=O)C=C[C@]12C
: