Target
Cytochrome P450 3A5
Ligand
BDBM50088503
Substrate
Meas. Tech.
ChEMBL_1486114 (CHEMBL3532903)
Ki
1200±n/a nM
Citation
 Walsky, RLObach, RSHyland, RKang, PZhou, SWest, MGeoghegan, KFHelal, CJWalker, GSGoosen, TCZientek, MA Selective mechanism-based inactivation of CYP3A4 by CYP3cide (PF-04981517) and its utility as an in vitro tool for delineating the relative roles of CYP3A4 versus CYP3A5 in the metabolism of drugs. Drug Metab Dispos 40:1686-97 (2012)  
Target
Name:
Cytochrome P450 3A5
Synonyms:
CP3A5_HUMAN Cytochrome P450 3A5 | Cytochrome P450 3A5 (CYP3A5)
Type:
Protein
Mol. Mass.:
57118.00
Organism:
Homo sapiens (Human)
Description:
P20815
Residue:
502
  
Inhibitor
Name:
BDBM50088503
Synonyms:
CHEMBL3527048
Type:
Small organic molecule
Emp. Form.:
C26H32N8
Mol. Mass.:
456.5859
SMILES:
Cc1ccc(cc1)-c1c(cnn1C)-c1nn(C)c2ncnc(N3CC[C@@H](C3)N3CCCCC3)c12
: