Target
Sodium/nucleoside cotransporter 2
Ligand
BDBM50088517
Substrate
Meas. Tech.
ChEMBL_1494516 (CHEMBL3528993)
Ki
31000±n/a nM
Citation
 Lepist, EIDamaraju, VLZhang, JGati, WPYao, SYSmith, KMKarpinski, EYoung, JDLeung, KHCass, CE Transport of A1 adenosine receptor agonist tecadenoson by human and mouse nucleoside transporters: evidence for blood-brain barrier transport by murine equilibrative nucleoside transporter 1 mENT1. Drug Metab Dispos 41:916-22 (2013)  
Target
Name:
Sodium/nucleoside cotransporter 2
Synonyms:
CNT2 SLC28A2
Type:
PROTEIN
Mol. Mass.:
71934.06
Organism:
Homo sapiens (Human)
Description:
ChEMBL_1477251
Residue:
658
  
Inhibitor
Name:
BDBM50088517
Synonyms:
CHEBI:16704 | Uridine
Type:
Small organic molecule
Emp. Form.:
C9H12N2O6
Mol. Mass.:
244.2014
SMILES:
OC[C@H]1O[C@H]([C@H](O)[C@@H]1O)n1ccc(=O)[nH]c1=O
: