Target
Equilibrative nucleoside transporter 1
Ligand
BDBM50088517
Substrate
Meas. Tech.
ChEMBL_1494513 (CHEMBL3528990)
IC50
52000±n/a nM
Citation
 Lepist, EIDamaraju, VLZhang, JGati, WPYao, SYSmith, KMKarpinski, EYoung, JDLeung, KHCass, CE Transport of A1 adenosine receptor agonist tecadenoson by human and mouse nucleoside transporters: evidence for blood-brain barrier transport by murine equilibrative nucleoside transporter 1 mENT1. Drug Metab Dispos 41:916-22 (2013)  
Target
Name:
Equilibrative nucleoside transporter 1
Synonyms:
ENT1 Equilibrative Nucleoside Transporter 1 (ENT1) Equilibrative nucleoside transporter 1 S29A1_HUMAN Solute carrier family 29 member 1
Type:
Multi-pass membrane protein
Mol. Mass.:
50225.92
Organism:
Homo sapiens (Human)
Description:
Residue:
456
  
Inhibitor
Name:
BDBM50088517
Synonyms:
CHEBI:16704 | Uridine
Type:
Small organic molecule
Emp. Form.:
C9H12N2O6
Mol. Mass.:
244.2014
SMILES:
OC[C@H]1O[C@H]([C@H](O)[C@@H]1O)n1ccc(=O)[nH]c1=O
: