Target
Melanocortin receptor 3
Ligand
BDBM50089405
Substrate
Meas. Tech.
ChEMBL_1496670 (CHEMBL3579241)
Ki
1000±n/a nM
Citation
 Ericson, MDWilczynski, ASorensen, NBXiang, ZHaskell-Luevano, C Discovery of aß-Hairpin Octapeptide, c[Pro-Arg-Phe-Phe-Dap-Ala-Phe-DPro], Mimetic of Agouti-Related Protein(87-132) [AGRP(87-132)] with Equipotent Mouse Melanocortin-4 Receptor (mMC4R) Antagonist Pharmacology. J Med Chem 58:4638-47 (2015)  
Target
Name:
Melanocortin receptor 3
Synonyms:
MC3-R Mc3r
Type:
PROTEIN
Mol. Mass.:
35808.24
Organism:
Mus musculus
Description:
ChEMBL_1498848
Residue:
323
  
Inhibitor
Name:
BDBM50089405
Synonyms:
CHEMBL3577987
Type:
Small organic molecule
Emp. Form.:
C54H66N12O9
Mol. Mass.:
1027.1768
SMILES:
[H][C@@]12CCCN1C(=O)[C@@]1([H])CCCN1C(=O)[C@H](Cc1ccccc1)NC(=O)[C@H](C)NC(=O)[C@H](CC(N)=O)NC(=O)[C@H](Cc1ccccc1)NC(=O)C(Cc1ccc3ccccc3c1)NC(=O)[C@H](CCCNC(N)=N)NC2=O
: