Target
Hypoxanthine-guanine phosphoribosyltransferase
Ligand
BDBM50089444
Substrate
Meas. Tech.
ChEMBL_1496953 (CHEMBL3579427)
Ki
30±n/a nM
Citation
 Eng, WSHocková, D?pacek, PJaneba, ZWest, NPWoods, KNaesens, LMKeough, DTGuddat, LW First Crystal Structures of Mycobacterium tuberculosis 6-Oxopurine Phosphoribosyltransferase: Complexes with GMP and Pyrophosphate and with Acyclic Nucleoside Phosphonates Whose Prodrugs Have Antituberculosis Activity. J Med Chem 58:4822-38 (2015)  
Target
Name:
Hypoxanthine-guanine phosphoribosyltransferase
Synonyms:
HGPRT HPRT HPRT_HUMAN Hypoxanthine-guanine phosphoribosyltransferase (HGPRT)
Type:
Protein
Mol. Mass.:
24579.61
Organism:
Homo sapiens (Human)
Description:
P00492
Residue:
218
  
Inhibitor
Name:
BDBM50089444
Synonyms:
CHEMBL3578110
Type:
Small organic molecule
Emp. Form.:
C15H29N7O8P2
Mol. Mass.:
497.3804
SMILES:
Nc1nc2n(CCN(CCN(CCO)CCP(O)(O)=O)CCP(O)(O)=O)cnc2c(=O)[nH]1
: