Target
Hypoxanthine-guanine phosphoribosyltransferase
Ligand
BDBM50089446
Substrate
Meas. Tech.
ChEMBL_1496953 (CHEMBL3579427)
Ki
40±n/a nM
Citation
 Eng, WSHocková, D?pacek, PJaneba, ZWest, NPWoods, KNaesens, LMKeough, DTGuddat, LW First Crystal Structures of Mycobacterium tuberculosis 6-Oxopurine Phosphoribosyltransferase: Complexes with GMP and Pyrophosphate and with Acyclic Nucleoside Phosphonates Whose Prodrugs Have Antituberculosis Activity. J Med Chem 58:4822-38 (2015)  
Target
Name:
Hypoxanthine-guanine phosphoribosyltransferase
Synonyms:
HGPRT HPRT HPRT_HUMAN Hypoxanthine-guanine phosphoribosyltransferase (HGPRT)
Type:
Protein
Mol. Mass.:
24579.61
Organism:
Homo sapiens (Human)
Description:
P00492
Residue:
218
  
Inhibitor
Name:
BDBM50089446
Synonyms:
CHEMBL3578112
Type:
Small organic molecule
Emp. Form.:
C16H31N7O8P2
Mol. Mass.:
511.407
SMILES:
Nc1nc2n(CCN(CCN(CCCO)CCP(O)(O)=O)CCP(O)(O)=O)cnc2c(=O)[nH]1
: