Target
Carboxypeptidase B2
Ligand
BDBM50089691
Substrate
Meas. Tech.
ChEMBL_1496377 (CHEMBL3580143)
IC50
3.0±n/a nM
Citation
 Halland, NBrönstrup, MCzech, JCzechtizky, WEvers, AFollmann, MKohlmann, MSchiell, MKurz, MSchreuder, HAKallus, C Novel Small Molecule Inhibitors of Activated Thrombin Activatable Fibrinolysis Inhibitor (TAFIa) from Natural Product Anabaenopeptin. J Med Chem 58:4839-44 (2015)  
Target
Name:
Carboxypeptidase B2
Synonyms:
CBPB2_HUMAN CPU Carboxypeptidase B2 isoform A Plasma carboxypeptidase B Thrombin-activable fibrinolysis inhibitor | pCPB
Type:
Enzyme
Mol. Mass.:
48432.74
Organism:
Homo sapiens (Human)
Description:
Q96IY4
Residue:
423
  
Inhibitor
Name:
BDBM50089691
Synonyms:
CHEMBL3577425
Type:
Small organic molecule
Emp. Form.:
C26H46N4O4
Mol. Mass.:
478.6678
SMILES:
CC1(C)C2CCC1(C)CC2NC(=O)[C@@H](CC1CCCCC1)NC(=O)N[C@@H](CCCCN)C(O)=O
: