Target
L-lactate dehydrogenase A chain
Ligand
BDBM50089929
Substrate
Meas. Tech.
ChEMBL_1499429 (CHEMBL3583864)
IC50
30±n/a nM
Citation
 Labadie, SDragovich, PSChen, JFauber, BPBoggs, JCorson, LBDing, CZEigenbrot, CGe, HHo, QLai, KWMa, SMalek, SPeterson, DPurkey, HERobarge, KSalphati, LSideris, SUltsch, MVanderPorten, EWei, BXu, QYen, IYue, QZhang, HZhang, XZhou, A Optimization of 5-(2,6-dichlorophenyl)-3-hydroxy-2-mercaptocyclohex-2-enones as potent inhibitors of human lactate dehydrogenase. Bioorg Med Chem Lett 25:75-82 (2015)  
Target
Name:
L-lactate dehydrogenase A chain
Synonyms:
Cell proliferation-inducing gene 19 protein L-lactate dehydrogenase A Chain LDH-A LDHA Lactate dehydrogenase A (LDHA) | Renal carcinoma antigen NY-REN-59
Type:
Protein
Mol. Mass.:
36694.85
Organism:
Homo sapiens (Human)
Description:
P00338::PDB Code: 4ajp
Residue:
332
  
Inhibitor
Name:
BDBM50089929
Synonyms:
CHEMBL3581205
Type:
Small organic molecule
Emp. Form.:
C24H24Cl3NO4S
Mol. Mass.:
528.876
SMILES:
COc1ccc(Cl)c(SC2=C(O)CC(CC2=O)c2c(Cl)ccc(NC3CCOCC3)c2Cl)c1
: