Target
Proteinase-activated receptor 2
Ligand
BDBM50091326
Substrate
Meas. Tech.
ChEMBL_1497756 (CHEMBL3583015)
IC50
5.0±n/a nM
Citation
 Abdel-Magid, AF Inhibitors of the PAR-2 Signaling Pathway May Treat Pain and Inflammation. ACS Med Chem Lett 6:487-8 (2015)  
Target
Name:
Proteinase-activated receptor 2
Synonyms:
F2RL1 PAR2 | PAR2_HUMAN
Type:
PROTEIN
Mol. Mass.:
44152.54
Organism:
Homo sapiens (Human)
Description:
ChEMBL_1497756
Residue:
397
  
Inhibitor
Name:
BDBM50091326
Synonyms:
CHEMBL3582248
Type:
Small organic molecule
Emp. Form.:
C27H34FN5O3
Mol. Mass.:
495.589
SMILES:
CC(C)c1cc(nn2cc(nc12)C(=O)N1CCN(CC1(C)C)C(=O)OC(C)(C)C)-c1ccc(F)cc1
: