Target
Monocarboxylate transporter 1
Ligand
BDBM4344
Substrate
Meas. Tech.
ChEMBL_1498543 (CHEMBL3584796)
IC50
500±n/a nM
Citation
 Gurrapu, SJonnalagadda, SKAlam, MANelson, GLSneve, MGDrewes, LRMereddy, VR Monocarboxylate transporter 1 inhibitors as potential anticancer agents. ACS Med Chem Lett 6:558-61 (2015)  
Target
Name:
Monocarboxylate transporter 1
Synonyms:
MCT 1 Mct1 Monocarboxylate transporter 1 (MCT1) Solute carrier family 16 member 1
Type:
Enzyme
Mol. Mass.:
53245.17
Organism:
Rattus norvegicus (Rat)
Description:
P53987
Residue:
494
  
Inhibitor
Name:
BDBM4344
Synonyms:
(2E)-2-cyano-3-(4-fluorophenyl)prop-2-enoic acid | benzylidenemalononitrile (BMN) deriv. 28
Type:
Small organic molecule
Emp. Form.:
C10H6FNO2
Mol. Mass.:
191.1585
SMILES:
OC(=O)C(=C\c1ccc(F)cc1)\C#N
: