Target
Melanocortin receptor 5
Ligand
BDBM50034910
Substrate
Meas. Tech.
ChEMBL_1498852 (CHEMBL3583826)
EC50
70±n/a nM
Citation
 Singh, ATala, SRFlores, VFreeman, KHaskell-Luevano, C Synthesis and Pharmacology ofa/ß(3)-Peptides Based on the Melanocortin Agonist Ac-His-dPhe-Arg-Trp-NH2 Sequence. ACS Med Chem Lett 6:568-72 (2015)  
Target
Name:
Melanocortin receptor 5
Synonyms:
MC5R_MOUSE Melanocortin receptor 5 | Melanocortin receptor 5 (MC5R)
Type:
Enzyme
Mol. Mass.:
36966.58
Organism:
Mus musculus (Mouse)
Description:
P41149
Residue:
325
  
Inhibitor
Name:
BDBM50034910
Synonyms:
(S)-2-{(S)-2-[(S)-2-acetylamino-3-(3H-imidazol-4-yl)-propionylamino]-3-phenyl-propionylamino}-5-guanidino-pentanoic acid [(S)-1-carbamoyl-2-(1H-indol-3-yl)-ethyl]-amide 2-{2-[2-Acetylamino-3-(3H-imidazol-4-yl)-propionylamino]-3-phenyl-propionylamino}-5-guanidino-pentanoic acid [1-carbamoyl-2-(1H-indol-3-yl)-ethyl]-amide Ac-His-D-Phe-Arg-D-Trp-NH2 Ac-His-Phe-Arg-Trp-NH2 | CHEMBL50056
Type:
Small organic molecule
Emp. Form.:
C34H43N11O5
Mol. Mass.:
685.7759
SMILES:
CC(=O)N[C@@H](Cc1cnc[nH]1)C(=O)N[C@@H](Cc1ccccc1)C(=O)N[C@@H](CCCNC(N)=N)C(=O)N[C@@H](Cc1c[nH]c2ccccc12)C(N)=O
: