Target
Beta-secretase 2
Ligand
BDBM50092471
Substrate
Meas. Tech.
ChEMBL_1500715 (CHEMBL3588065)
IC50
497±n/a nM
Citation
 Winneroski, LLSchiffler, MAErickson, JAMay, PCMonk, SATimm, DEAudia, JEBeck, JPBoggs, LNBorders, ARBoyer, RDBrier, RAHudziak, KJKlimkowski, VJGarcia Losada, PMathes, BMStout, SLWatson, BMMergott, DJ Preparation and biological evaluation of conformationally constrained BACE1 inhibitors. Bioorg Med Chem 23:3260-8 (2015)  
Target
Name:
Beta-secretase 2
Synonyms:
AEPLC ASP1 Asp 1 Aspartyl protease 1 BACE2_HUMAN Beta-secretase (BACE) Beta-secretase 2 (BACE-2) Beta-site APP-cleaving enzyme 2 Memapsin-1 beta-Secretase (BACE-2)
Type:
Protein
Mol. Mass.:
56171.20
Organism:
Homo sapiens (Human)
Description:
Q9Y5Z0
Residue:
518
  
Inhibitor
Name:
BDBM50092471
Synonyms:
CHEMBL3586130
Type:
Small organic molecule
Emp. Form.:
C15H19Cl2N3OS
Mol. Mass.:
360.302
SMILES:
Cl.NC1=NC2CCC(CC2CS1)NC(=O)c1cccc(Cl)c1
: