Target
ATPase family AAA domain-containing protein 2
Ligand
BDBM50093462
Substrate
Meas. Tech.
ChEMBL_1500426 (CHEMBL3587157)
IC50
100000±n/a nM
Citation
 Demont, EHChung, CWFurze, RCGrandi, PMichon, AMWellaway, CBarrett, NBridges, AMCraggs, PDDiallo, HDixon, DPDouault, CEmmons, AJJones, EJKaramshi, BVLocke, KMitchell, DJMouzon, BHPrinjha, RKRoberts, ADSheppard, RJWatson, RJBamborough, P Fragment-Based Discovery of Low-Micromolar ATAD2 Bromodomain Inhibitors. J Med Chem 58:5649-73 (2015)  
Target
Name:
ATPase family AAA domain-containing protein 2
Synonyms:
AAA nuclear coregulator cancer-associated protein ATAD2 PRO2000
Type:
PROTEIN
Mol. Mass.:
158546.30
Organism:
Homo sapiens (Human)
Description:
ChEMBL_1500426
Residue:
1390
  
Inhibitor
Name:
BDBM50093462
Synonyms:
CHEMBL3586689
Type:
Small organic molecule
Emp. Form.:
C14H19N3O
Mol. Mass.:
245.3202
SMILES:
CN(C)CCNc1cccc2cc(C)c(=O)[nH]c12
: