Target
Nitric oxide synthase, inducible
Ligand
BDBM50095304
Substrate
Meas. Tech.
ChEMBL_1503718 (CHEMBL3592389)
IC50
500±n/a nM
Citation
 Maccallini, CMontagnani, MPaciotti, RAmmazzalorso, ADe Filippis, BDi Matteo, MDi Silvestre, SFantacuzzi, MGiampietro, LPotenza, MARe, NPandolfi, AAmoroso, R Selective Acetamidine-Based Nitric Oxide Synthase Inhibitors: Synthesis, Docking, and Biological Studies. ACS Med Chem Lett 6:635-40 (2015)  
Target
Name:
Nitric oxide synthase, inducible
Synonyms:
Inducible NO synthase Inducible nitric oxide synthase (iNOS) MAC-NOS NOS type II Nitric Oxide Synthase, inducible Nos2
Type:
Enzyme
Mol. Mass.:
130595.79
Organism:
Mus musculus (mouse)
Description:
Recombinant enzyme overexpressed in E. coli.
Residue:
1144
  
Inhibitor
Name:
BDBM50095304
Synonyms:
CHEMBL3589093
Type:
Small organic molecule
Emp. Form.:
C24H25N5O4
Mol. Mass.:
447.4864
SMILES:
CC(=N)NCc1cccc(CN(Cc2ccc(cc2)[N+]([O-])=O)Cc2ccc(cc2)[N+]([O-])=O)c1
: