Target
Nitric oxide synthase, endothelial
Ligand
BDBM50095298
Substrate
Meas. Tech.
ChEMBL_1503719 (CHEMBL3592390)
IC50
>1000000±n/a nM
Citation
 Maccallini, CMontagnani, MPaciotti, RAmmazzalorso, ADe Filippis, BDi Matteo, MDi Silvestre, SFantacuzzi, MGiampietro, LPotenza, MARe, NPandolfi, AAmoroso, R Selective Acetamidine-Based Nitric Oxide Synthase Inhibitors: Synthesis, Docking, and Biological Studies. ACS Med Chem Lett 6:635-40 (2015)  
Target
Name:
Nitric oxide synthase, endothelial
Synonyms:
Constitutive NOS Endothelial nitric oxide synthase NOS type III NOS3_BOVIN Nitric-oxide synthase, endothelial | cNOS
Type:
Enzyme
Mol. Mass.:
133292.26
Organism:
Bos taurus (bovine)
Description:
Recombinant eNOS overexpressed in E. coli was used in enzyme assays.
Residue:
1205
  
Inhibitor
Name:
BDBM50095298
Synonyms:
CHEMBL3589087
Type:
Small organic molecule
Emp. Form.:
C14H19N3O3
Mol. Mass.:
277.319
SMILES:
CC(=N)NCc1cccc(CNC(=O)CCC(O)=O)c1
: