Target
Nitric oxide synthase, endothelial
Ligand
BDBM50226527
Substrate
Meas. Tech.
ChEMBL_1503719 (CHEMBL3592390)
IC50
350000±n/a nM
Citation
 Maccallini, CMontagnani, MPaciotti, RAmmazzalorso, ADe Filippis, BDi Matteo, MDi Silvestre, SFantacuzzi, MGiampietro, LPotenza, MARe, NPandolfi, AAmoroso, R Selective Acetamidine-Based Nitric Oxide Synthase Inhibitors: Synthesis, Docking, and Biological Studies. ACS Med Chem Lett 6:635-40 (2015)  
Target
Name:
Nitric oxide synthase, endothelial
Synonyms:
Constitutive NOS Endothelial nitric oxide synthase NOS type III NOS3_BOVIN Nitric-oxide synthase, endothelial | cNOS
Type:
Enzyme
Mol. Mass.:
133292.26
Organism:
Bos taurus (bovine)
Description:
Recombinant eNOS overexpressed in E. coli was used in enzyme assays.
Residue:
1205
  
Inhibitor
Name:
BDBM50226527
Synonyms:
CHEMBL107251 N-(3-(aminomethyl)benzyl)acetimidamide N-(3-aminomethyl)benzylacetimidamide N-[[3-(aminomethyl)phenyl]methyl]-ethanimidamide | [N-(3-aminomethyl)benzylactamidine]
Type:
Small organic molecule
Emp. Form.:
C10H15N3
Mol. Mass.:
177.2462
SMILES:
CC(N)=NCc1cccc(CN)c1
: