Target
N-lysine methyltransferase SMYD2
Ligand
BDBM50396022
Substrate
Meas. Tech.
ChEMBL_1504425 (CHEMBL3592990)
IC50
120±n/a nM
Citation
 Sweis, RFWang, ZAlgire, MArrowsmith, CHBrown, PJChiang, GGGuo, JJakob, CGKennedy, SLi, FMaag, DShaw, BSoni, NBVedadi, MPappano, WN Discovery of A-893, A New Cell-Active Benzoxazinone Inhibitor of Lysine Methyltransferase SMYD2. ACS Med Chem Lett 6:695-700 (2015)  
Target
Name:
N-lysine methyltransferase SMYD2
Synonyms:
HSKM-B KMT3C N-lysine methyltransferase SMYD2 SET and MYND domain-containing protein 2 (SMYD2) SMYD2_HUMAN
Type:
Enzyme
Mol. Mass.:
49689.57
Organism:
Homo sapiens (Human)
Description:
Q9NRG4
Residue:
433
  
Inhibitor
Name:
BDBM50396022
Synonyms:
CHEMBL2169920
Type:
Small organic molecule
Emp. Form.:
C29H38Cl2N4O4
Mol. Mass.:
577.542
SMILES:
Oc1ccc(CCNCCN(C2CCCCC2)C(=O)CCNCCc2ccc(Cl)c(Cl)c2)c2OCC(=O)Nc12
: