Target
Transient receptor potential cation channel subfamily A member 1
Ligand
BDBM50240850
Substrate
Meas. Tech.
ChEMBL_1506134 (CHEMBL3596064)
EC50
370±n/a nM
Citation
 Terada, YMasuda, HWatanabe, T Structure-Activity Relationship Study on Isothiocyanates: Comparison of TRPA1-Activating Ability between Allyl Isothiocyanate and Specific Flavor Components of Wasabi, Horseradish, and White Mustard. J Nat Prod 78:1937-41 (2015)  
Target
Name:
Transient receptor potential cation channel subfamily A member 1
Synonyms:
ANKTM1 TRPA1 Transformation-sensitive protein p120 | Transient receptor potential cation channel subfamily A member 1 (TRPA1)
Type:
Protein
Mol. Mass.:
127514.20
Organism:
Homo sapiens (Human)
Description:
O75762
Residue:
1119
  
Inhibitor
Name:
BDBM50240850
Synonyms:
(2-Isothiocyanato-ethyl)-benzene Phenethyl isothiocyanate phenylethyl isothiocyanate
Type:
Small organic molecule
Emp. Form.:
C9H9NS
Mol. Mass.:
163.239
SMILES:
S=C=NCCc1ccccc1
: