Target
Transient receptor potential cation channel subfamily V member 1
Ligand
BDBM50104730
Substrate
Meas. Tech.
ChEMBL_1506136 (CHEMBL3596066)
EC50
170000±n/a nM
Citation
 Terada, YMasuda, HWatanabe, T Structure-Activity Relationship Study on Isothiocyanates: Comparison of TRPA1-Activating Ability between Allyl Isothiocyanate and Specific Flavor Components of Wasabi, Horseradish, and White Mustard. J Nat Prod 78:1937-41 (2015)  
Target
Name:
Transient receptor potential cation channel subfamily V member 1
Synonyms:
Capsaicin receptor Osm-9-like TRP channel 1 TRPV1_HUMAN Transient receptor potential cation channel subfamily V member 1 (TRPV1) Transient receptor potential cation channel subfamily V member 1(TRPV1) Vanilloid VR1 Vanilloid receptor 1 Vanilloid receptor 1 (VRI/TRPV1)
Type:
Protein
Mol. Mass.:
94960.75
Organism:
Homo sapiens (Human)
Description:
Q8NER1
Residue:
839
  
Inhibitor
Name:
BDBM50104730
Synonyms:
CHEMBL3593946
Type:
Small organic molecule
Emp. Form.:
C8H7NOS
Mol. Mass.:
165.212
SMILES:
Oc1ccc(CN=C=S)cc1
: