Target
Serine/threonine-protein kinase PAK 4
Ligand
BDBM50097144
Substrate
Meas. Tech.
ChEMBL_1499558 (CHEMBL3584416)
Ki
4.0±n/a nM
Citation
 Crawford, JJLee, WAliagas, IMathieu, SHoeflich, KPZhou, WWang, WRouge, LMurray, LLa, HLiu, NFan, PWCheong, JHeise, CERamaswamy, SMintzer, RLiu, YChao, QRudolph, J Structure-Guided Design of Group I Selective p21-Activated Kinase Inhibitors. J Med Chem 58:5121-36 (2015)  
Target
Name:
Serine/threonine-protein kinase PAK 4
Synonyms:
KIAA1142 PAK4_HUMAN | p21-Activated kinase 4 (PAK4)
Type:
Protein
Mol. Mass.:
64098.01
Organism:
Homo sapiens (Human)
Description:
O96013
Residue:
591
  
Inhibitor
Name:
BDBM50097144
Synonyms:
CHEMBL3580963
Type:
Small organic molecule
Emp. Form.:
C17H25N7
Mol. Mass.:
327.4273
SMILES:
N[C@H]1CC[C@@H](CNc2nccc(Nc3cc([nH]n3)C3CC3)n2)CC1
: