Target
Kappa-type opioid receptor
Ligand
BDBM50097703
Substrate
Meas. Tech.
ChEMBL_1504513 (CHEMBL3590955)
IC50
84±n/a nM
Citation
 Frankowski, KJSlauson, SRLovell, KMPhillips, AMStreicher, JMZhou, LWhipple, DASchoenen, FJPrisinzano, TEBohn, LMAubé, J Potency enhancement of the¿-opioid receptor antagonist probe ML140 through sulfonamide constraint utilizing a tetrahydroisoquinoline motif. Bioorg Med Chem 23:3948-56 (2015)  
Target
Name:
Kappa-type opioid receptor
Synonyms:
K-OR-1 Kappa-opioid receptor (KOR) Kappa-type opioid receptor (KOR) OPIATE Kappa OPRK1 kappa opioid receptor (KOR)
Type:
G Protein-Coupled Receptor (GPCR)
Mol. Mass.:
42648.76
Organism:
Homo sapiens (Human)
Description:
P41145
Residue:
380
  
Inhibitor
Name:
BDBM50097703
Synonyms:
CHEMBL3590199
Type:
Small organic molecule
Emp. Form.:
C30H36ClN3O3S
Mol. Mass.:
554.143
SMILES:
Cc1ccc(cc1)S(=O)(=O)N1CCc2cc(ccc2C1)C(=O)NCCN(Cc1ccc(Cl)cc1)C(C)(C)C
: