Target
D(4) dopamine receptor
Ligand
BDBM123850
Substrate
Meas. Tech.
ChEMBL_1504530 (CHEMBL3591126)
Ki
2600±n/a nM
Citation
 Keck, TMBanala, AKSlack, RDBurzynski, CBonifazi, AOkunola-Bakare, OMMoore, MDeschamps, JRRais, RSlusher, BSNewman, AH Using click chemistry toward novel 1,2,3-triazole-linked dopamine D3 receptor ligands. Bioorg Med Chem 23:4000-12 (2015)  
Target
Name:
D(4) dopamine receptor
Synonyms:
D(2C) dopamine receptor DOPAMINE D4.2 DRD4 Dopamine D4 receptor
Type:
Enzyme
Mol. Mass.:
48373.19
Organism:
Homo sapiens (Human)
Description:
P21917
Residue:
419
  
Inhibitor
Name:
BDBM123850
Synonyms:
US8748608, 34 US8748608, 34 Enantiomer B
Type:
Small organic molecule
Emp. Form.:
C23H26Cl2N4O2
Mol. Mass.:
461.384
SMILES:
OC(CCNC(=O)c1cc2ccccc2[nH]1)CN1CCN(CC1)c1cccc(Cl)c1Cl
: