Target
Dipeptidyl peptidase 4
Ligand
BDBM50098998
Substrate
Meas. Tech.
ChEMBL_1459666 (CHEMBL3370155)
IC50
160±n/a nM
Citation
 Ji, XXia, CWang, JSu, MZhang, LDong, TLi, ZWan, XLi, JLi, JZhao, LGao, ZJiang, HLiu, H Design, synthesis and biological evaluation of 4-fluoropyrrolidine-2-carbonitrile and octahydrocyclopenta[b]pyrrole-2-carbonitrile derivatives as dipeptidyl peptidase IV inhibitors. Eur J Med Chem 86:242-56 (2014)  
Target
Name:
Dipeptidyl peptidase 4
Synonyms:
ADABP Adenosine deaminase complexing protein 2 CD_antigen=CD26 DPP4 DPPIV Dipeptidyl peptidase 4 (DPP IV) Dipeptidyl peptidase 4 (DPP4) Dipeptidyl peptidase 4 membrane form Dipeptidyl peptidase IV Dipeptidyl peptidase IV (DDP-IV) Dipeptidyl peptidase IV membrane form Dipeptidyl peptidase-IV (DPP-4) T-cell activation antigen CD26 | TP103
Type:
Enzyme
Mol. Mass.:
88271.01
Organism:
Homo sapiens (Human)
Description:
P27487
Residue:
766
  
Inhibitor
Name:
BDBM50098998
Synonyms:
CHEMBL3330051
Type:
Small organic molecule
Emp. Form.:
C16H20FN3O
Mol. Mass.:
289.3479
SMILES:
Cc1ccccc1C[C@@H](N)CC(=O)N1C[C@@H](F)C[C@H]1C#N
: