Target
Cytochrome P450 1A2
Ligand
BDBM50236897
Substrate
Meas. Tech.
ChEMBL_1456765 (CHEMBL3367087)
IC50
3620±n/a nM
Citation
 Park, EJAhn, YGJung, SHBang, HJKim, MHong, DJKim, JSuh, KHKim, YJKim, DKim, EYLee, KMin, KH Discovery of novel pyrimidine and malonamide derivatives as TGR5 agonists. Bioorg Med Chem Lett 24:4271-5 (2014)  
Target
Name:
Cytochrome P450 1A2
Synonyms:
CP1A2_HUMAN CYPIA2 Cytochrome P(3)450 Cytochrome P450 1A2 (CYP1A2) Cytochrome P450-P3
Type:
Enzyme
Mol. Mass.:
58423.38
Organism:
Homo sapiens (Human)
Description:
P05177
Residue:
516
  
Inhibitor
Name:
BDBM50236897
Synonyms:
3-(furan-2-ylmethyl)-1,8-dimethyl-1H-purine-2,6(3H,7H)-dione US9180183, Furafylline | furafylline
Type:
Small organic molecule
Emp. Form.:
C12H12N4O3
Mol. Mass.:
260.2487
SMILES:
Cc1nc2n(Cc3ccco3)c(=O)n(C)c(=O)c2[nH]1
: