Target
Kappa-type opioid receptor
Ligand
BDBM50102828
Substrate
Meas. Tech.
ChEMBL_1432429 (CHEMBL3385711)
Ki
0.110000±n/a nM
Citation
 Watanabe, YKitazawa, SFujii, HNemoto, THirayama, SIwai, TGouda, HHirono, SNagasea, H Design, synthesis, and structure-activity relationship of novel opioid¿ receptor selective agonists:a-iminoamide derivatives with an azabicyclo[2.2.2]octene skeleton. Bioorg Med Chem Lett 24:4980-3 (2014)  
Target
Name:
Kappa-type opioid receptor
Synonyms:
Kappa Opioid Receptor OPRK1 Opiate Kappa 1 | mu/kappa opioid receptor
Type:
G Protein-Coupled Receptor (GPCR)
Mol. Mass.:
42744.99
Organism:
Cavia porcellus (domestic guinea pig)
Description:
P41144
Residue:
380
  
Inhibitor
Name:
BDBM50102828
Synonyms:
CHEMBL3339372
Type:
Small organic molecule
Emp. Form.:
C30H35N3O4
Mol. Mass.:
501.6166
SMILES:
Oc1ccc2CC3N(CC4CC4)CCC45C(Oc1c24)[C@@]1(O)CC[C@@]35N[C@H]1CC(=O)NCc1ccccc1
: