Target
Cytochrome P450 2C9
Ligand
BDBM8610
Substrate
Meas. Tech.
ChEMBL_1493771 (CHEMBL3530854)
IC50
8940±n/a nM
Citation
 Lee, CAJones, JPKatayama, JKaspera, RJiang, YFreiwald, SSmith, EWalker, GSTotah, RA Identifying a selective substrate and inhibitor pair for the evaluation of CYP2J2 activity. Drug Metab Dispos 40:943-51 (2012)  
Target
Name:
Cytochrome P450 2C9
Synonyms:
(R)-limonene 6-monooxygenase CP2C9_HUMAN CYP2C9 Cytochrome P450 2C9 (CYP2C9 ) P-450MP P450 PB-1 | S-mephenytoin 4-hydroxylase
Type:
Enzyme
Mol. Mass.:
55636.33
Organism:
Homo sapiens (Human)
Description:
P11712
Residue:
490
  
Inhibitor
Name:
BDBM8610
Synonyms:
1-[4-(4-{[(2R,4S)-2-(2,4-dichlorophenyl)-2-(1H-imidazol-1-ylmethyl)-1,3-dioxolan-4-yl]methoxy}phenyl)piperazin-1-yl]ethan-1-one CHEMBL75 Ketoconazole US9138393, Ketoconozole | US9144538, Ketoconozole
Type:
Small organic molecule
Emp. Form.:
C26H28Cl2N4O4
Mol. Mass.:
531.431
SMILES:
[H][C@]1(COc2ccc(cc2)N2CCN(CC2)C(C)=O)CO[C@@](Cn2ccnc2)(O1)c1ccc(Cl)cc1Cl
: