Target
Cytochrome P450 3A4
Ligand
BDBM50436176
Substrate
Meas. Tech.
ChEMBL_1487309 (CHEMBL3534776)
IC50
>30000±n/a nM
Citation
 Lee, CAJones, JPKatayama, JKaspera, RJiang, YFreiwald, SSmith, EWalker, GSTotah, RA Identifying a selective substrate and inhibitor pair for the evaluation of CYP2J2 activity. Drug Metab Dispos 40:943-51 (2012)  
Target
Name:
Cytochrome P450 3A4
Synonyms:
Albendazole monooxygenase CP3A4_HUMAN CYP3A4 CYPIIIA4 Cytochrome P450 3A4 (CYP3A4) Nifedipine oxidase Taurochenodeoxycholate 6-alpha-hydroxylase
Type:
Enzyme
Mol. Mass.:
57349.57
Organism:
Homo sapiens (Human)
Description:
Residue:
503
  
Inhibitor
Name:
BDBM50436176
Synonyms:
Dynacirc ISRADIPINE PN-200-110
Type:
Small organic molecule
Emp. Form.:
C19H21N3O5
Mol. Mass.:
371.3871
SMILES:
COC(=O)C1=C(C)NC(C)=C(C1c1cccc2nonc12)C(=O)OC(C)C
: