Target
Lysosomal alpha-glucosidase
Ligand
BDBM50104671
Substrate
Meas. Tech.
ChEMBL_1506060 (CHEMBL3595864)
IC50
2200±n/a nM
Citation
 Liu, YYang, QXia, GHuang, HLi, HMa, LLu, YHe, LXia, XShe, Z Polyketides witha-Glucosidase Inhibitory Activity from a Mangrove Endophytic Fungus, Penicillium sp. HN29-3B1. J Nat Prod 78:1816-22 (2015)  
Target
Name:
Lysosomal alpha-glucosidase
Synonyms:
70 kDa lysosomal alpha-glucosidase Acid maltase Alpha glucosidase LYAG_HUMAN
Type:
PROTEIN
Mol. Mass.:
105312.45
Organism:
Homo sapiens (Human)
Description:
ChEMBL_1506060
Residue:
952
  
Inhibitor
Name:
BDBM50104671
Synonyms:
CHEMBL3593568
Type:
Small organic molecule
Emp. Form.:
C13H12O4
Mol. Mass.:
232.232
SMILES:
Cc1cc(O)c(O)cc1-c1cc(O)cc(O)c1
: