Target
5-hydroxytryptamine receptor 2A
Ligand
BDBM123850
Substrate
Meas. Tech.
ChEMBL_1506484 (CHEMBL3599950)
Ki
48±n/a nM
Citation
 Boateng, CABakare, OMZhan, JBanala, AKBurzynski, CPommier, EKeck, TMDonthamsetti, PJavitch, JARais, RSlusher, BSXi, ZXNewman, AH High Affinity Dopamine D3 Receptor (D3R)-Selective Antagonists Attenuate Heroin Self-Administration in Wild-Type but not D3R Knockout Mice. J Med Chem 58:6195-213 (2015)  
Target
Name:
5-hydroxytryptamine receptor 2A
Synonyms:
5-HT-2 5-HT2A 5-hydroxytryptamine receptor 2A (5HT-2A) 5HT2A_HUMAN HTR2A | Serotonin receptor 2A
Type:
undefined
Mol. Mass.:
52607.65
Organism:
Homo sapiens (Human)
Description:
P28223
Residue:
471
  
Inhibitor
Name:
BDBM123850
Synonyms:
US8748608, 34 US8748608, 34 Enantiomer B
Type:
Small organic molecule
Emp. Form.:
C23H26Cl2N4O2
Mol. Mass.:
461.384
SMILES:
OC(CCNC(=O)c1cc2ccccc2[nH]1)CN1CCN(CC1)c1cccc(Cl)c1Cl
: