Target
5-hydroxytryptamine receptor 2C
Ligand
BDBM123850
Substrate
Meas. Tech.
ChEMBL_1506485 (CHEMBL3599951)
Ki
86±n/a nM
Citation
 Boateng, CABakare, OMZhan, JBanala, AKBurzynski, CPommier, EKeck, TMDonthamsetti, PJavitch, JARais, RSlusher, BSXi, ZXNewman, AH High Affinity Dopamine D3 Receptor (D3R)-Selective Antagonists Attenuate Heroin Self-Administration in Wild-Type but not D3R Knockout Mice. J Med Chem 58:6195-213 (2015)  
Target
Name:
5-hydroxytryptamine receptor 2C
Synonyms:
5-HT-1C 5-HT1C 5-HT2C-INI 5-HTR2C 5-hydroxytryptamine receptor 2C (5-HT-2C) 5HT-1C HTR1C Serotonin (5-HT3) receptor Serotonin Receptor 2C
Type:
G Protein-Coupled Receptor (GPCR)
Mol. Mass.:
51836.79
Organism:
Homo sapiens (Human)
Description:
P28335
Residue:
458
  
Inhibitor
Name:
BDBM123850
Synonyms:
US8748608, 34 US8748608, 34 Enantiomer B
Type:
Small organic molecule
Emp. Form.:
C23H26Cl2N4O2
Mol. Mass.:
461.384
SMILES:
OC(CCNC(=O)c1cc2ccccc2[nH]1)CN1CCN(CC1)c1cccc(Cl)c1Cl
: