Target
D(2) dopamine receptor
Ligand
BDBM123850
Substrate
Meas. Tech.
ChEMBL_1506477 (CHEMBL3599876)
EC50
170±n/a nM
Citation
 Boateng, CABakare, OMZhan, JBanala, AKBurzynski, CPommier, EKeck, TMDonthamsetti, PJavitch, JARais, RSlusher, BSXi, ZXNewman, AH High Affinity Dopamine D3 Receptor (D3R)-Selective Antagonists Attenuate Heroin Self-Administration in Wild-Type but not D3R Knockout Mice. J Med Chem 58:6195-213 (2015)  
Target
Name:
D(2) dopamine receptor
Synonyms:
D(2) dopamine receptor DOPAMINE D2 Long DRD2 Dopamine D2 receptor Dopamine D2 receptor (D2R) Dopamine2-like | d2
Type:
Cell-surface receptors
Mol. Mass.:
50647.10
Organism:
Homo sapiens (Human)
Description:
P14416
Residue:
443
  
Inhibitor
Name:
BDBM123850
Synonyms:
US8748608, 34 US8748608, 34 Enantiomer B
Type:
Small organic molecule
Emp. Form.:
C23H26Cl2N4O2
Mol. Mass.:
461.384
SMILES:
OC(CCNC(=O)c1cc2ccccc2[nH]1)CN1CCN(CC1)c1cccc(Cl)c1Cl
: