Target
Carbonic anhydrase
Ligand
BDBM50079047
Substrate
Meas. Tech.
ChEMBL_1507030 (CHEMBL3599984)
pH
8.3±n/a
Ki
32±n/a nM
Comments
extracted
Citation
 Pinard, MALotlikar, SRBoone, CDVullo, DSupuran, CTPatrauchan, MAMcKenna, R Structure and inhibition studies of a type II beta-carbonic anhydrase psCA3 from Pseudomonas aeruginosa. Bioorg Med Chem 23:4831-8 (2015)  
Target
Name:
Carbonic anhydrase
Synonyms:
Carbonate dehydratase | Carbonic anhydrase
Type:
PROTEIN
Mol. Mass.:
24220.80
Organism:
Pseudomonas aeruginosa (strain ATCC 15692 / PAO1 / 1C / PRS 101 / LMG12228)
Description:
ChEMBL_109845
Residue:
215
  
Inhibitor
Name:
BDBM50079047
Synonyms:
3-Amino-benzenesulfonamide CHEMBL6852
Type:
Small organic molecule
Emp. Form.:
C6H8N2O2S
Mol. Mass.:
172.205
SMILES:
Nc1cccc(c1)S(N)(=O)=O
: