Target
Acetylcholinesterase
Ligand
BDBM50011780
Substrate
Meas. Tech.
ChEMBL_1507812 (CHEMBL3598676)
Kd
17770±n/a nM
Citation
 Valiveti, AKBhalerao, UMAcharya, JKarade, HNAcharya, BNRaviraju, GHalve, AKKaushik, MP Synthesis and in vitro kinetic evaluation of N-thiazolylacetamido monoquaternary pyridinium oximes as reactivators of sarin, O-ethylsarin and VX inhibited human acetylcholinesterase (hAChE). Bioorg Med Chem 23:4899-910 (2015)  
Target
Name:
Acetylcholinesterase
Synonyms:
ACES_HUMAN Acetylcholinesterase (AChE) | Acetylcholinesterase (human AChE)
Type:
Enzyme
Mol. Mass.:
67792.70
Organism:
Homo sapiens (Human)
Description:
P22303
Residue:
614
  
Inhibitor
Name:
BDBM50011780
Synonyms:
2-[(E)-(hydroxyimino)methyl]-1-methylpyridinium chloride PRALIDOXIME Pralidoxine chloride
Type:
Small organic molecule
Emp. Form.:
C7H9N2O
Mol. Mass.:
137.1586
SMILES:
C[n+]1ccccc1CN=O
: