Target
Eukaryotic translation initiation factor 4E
Ligand
BDBM50316302
Substrate
Meas. Tech.
ChEMBL_1511842 (CHEMBL3608168)
IC50
5720±n/a nM
Citation
 Ziemniak, MKowalska, JLukaszewicz, MZuberek, JWnek, KDarzynkiewicz, EJemielity, J Phosphate-modified analogues of m(7)GTP and m(7)Gppppm(7)G-Synthesis and biochemical properties. Bioorg Med Chem 23:5369-81 (2015)  
Target
Name:
Eukaryotic translation initiation factor 4E
Synonyms:
EIF4E | IF4E_RABIT
Type:
PROTEIN
Mol. Mass.:
25047.40
Organism:
Oryctolagus cuniculus
Description:
ChEMBL_1511842
Residue:
217
  
Inhibitor
Name:
BDBM50316302
Synonyms:
((2R,3S,4R,5R)-5-(2-amino-7-methyl-6-oxo-1H-purin-1-ium-9(6H)-yl)-3,4-dihydroxytetrahydrofuran-2-yl)methyl hydrogen triphosphate | CHEMBL1094973
Type:
Small organic molecule
Emp. Form.:
C11H18N5O14P3
Mol. Mass.:
537.207
SMILES:
C[n+]1cn([C@@H]2O[C@H](COP([O-])(=O)OP(O)(=O)OP(O)(O)=O)[C@@H](O)[C@H]2O)c2nc(N)[nH]c(=O)c12
: