Target
Serine/threonine-protein kinase ULK1
Ligand
BDBM50111577
Substrate
Meas. Tech.
ChEMBL_1510275 (CHEMBL3606871)
IC50
5.3±n/a nM
Citation
 Lazarus, MBShokat, KM Discovery and structure of a new inhibitor scaffold of the autophagy initiating kinase ULK1. Bioorg Med Chem 23:5483-8 (2015)  
Target
Name:
Serine/threonine-protein kinase ULK1
Synonyms:
ATG1 KIAA0722 ULK1_HUMAN hATG1
Type:
PROTEIN
Mol. Mass.:
112661.80
Organism:
Homo sapiens (Human)
Description:
ChEMBL_1510275
Residue:
1050
  
Inhibitor
Name:
BDBM50111577
Synonyms:
CHEMBL3605055
Type:
Small organic molecule
Emp. Form.:
C22H20N8
Mol. Mass.:
396.4478
SMILES:
C1CC(C1)c1cc(Nc2nc(Nc3ccc4[nH]cnc4c3)nc3ccccc23)n[nH]1
: