Target
Tyrosine-protein kinase BTK
Ligand
BDBM50111687
Substrate
Meas. Tech.
ChEMBL_1510462 (CHEMBL3607488)
IC50
>10000±n/a nM
Citation
 Zhao, XXin, MWang, YHuang, WJin, QTang, FWu, GZhao, YXiang, H Discovery of thieno[3,2-c]pyridin-4-amines as novel Bruton's tyrosine kinase (BTK) inhibitors. Bioorg Med Chem 23:6059-68 (2015)  
Target
Name:
Tyrosine-protein kinase BTK
Synonyms:
AGMX1 Agammaglobulinaemia tyrosine kinase B cell progenitor kinase BPK BTK_HUMAN Tyrosine Kinase BTK Tyrosine-protein kinase BTK (BTK)
Type:
Enzyme
Mol. Mass.:
76289.95
Organism:
Homo sapiens (Human)
Description:
Q06187
Residue:
659
  
Inhibitor
Name:
BDBM50111687
Synonyms:
CHEMBL3605100
Type:
Small organic molecule
Emp. Form.:
C23H22N2OS
Mol. Mass.:
374.499
SMILES:
CCCCc1cnc(N)c2c(csc12)-c1ccc(Oc2ccccc2)cc1
: