Target
Amiloride-sensitive sodium channel subunit alpha
Ligand
BDBM50112169
Substrate
Meas. Tech.
ChEMBL_1512947 (CHEMBL3609986)
IC50
20±n/a nM
Citation
 Blass, B Novel Pyrazine Amide Compounds. ACS Med Chem Lett 6:729-31 (2015)  
Target
Name:
Amiloride-sensitive sodium channel subunit alpha
Synonyms:
Alpha-ENaC Amiloride-sensitive sodium channel subunit alpha Nonvoltage-gated sodium channel 1 subunit alpha SCNNA_MOUSE | Scnn1a
Type:
PROTEIN
Mol. Mass.:
78903.70
Organism:
Mus musculus
Description:
ChEMBL_109863
Residue:
699
  
Inhibitor
Name:
BDBM50112169
Synonyms:
CHEMBL3608424
Type:
Small organic molecule
Emp. Form.:
C35H50Cl2N8O3
Mol. Mass.:
701.729
SMILES:
[Cl-].COc1ccc(CCC[N+]2(CCCc3ccc(cc3)C(=O)NCCCN(C)C)CCCC(C2)NC(=O)c2nc(Cl)c(N)nc2N)cc1
: