Target
Amiloride-sensitive sodium channel subunit alpha
Ligand
BDBM50112172
Substrate
Meas. Tech.
ChEMBL_1512947 (CHEMBL3609986)
IC50
13±n/a nM
Citation
 Blass, B Novel Pyrazine Amide Compounds. ACS Med Chem Lett 6:729-31 (2015)  
Target
Name:
Amiloride-sensitive sodium channel subunit alpha
Synonyms:
Alpha-ENaC Amiloride-sensitive sodium channel subunit alpha Nonvoltage-gated sodium channel 1 subunit alpha SCNNA_MOUSE | Scnn1a
Type:
PROTEIN
Mol. Mass.:
78903.70
Organism:
Mus musculus
Description:
ChEMBL_109863
Residue:
699
  
Inhibitor
Name:
BDBM50112172
Synonyms:
CHEMBL3608427
Type:
Small organic molecule
Emp. Form.:
C38H54Cl2N8O7
Mol. Mass.:
805.791
SMILES:
[Cl-].Nc1nc(N)c(nc1Cl)C(=O)N[C@H]1CCC[N+](CCCc2ccc(OCC(=O)NCCCO)cc2)(CCCc2ccc(OCC(=O)NCCCO)cc2)C1
: