Target
Cytochrome P450 2D6
Ligand
BDBM50081195
Substrate
Meas. Tech.
ChEMBL_1512961 (CHEMBL3610074)
IC50
>100000±n/a nM
Citation
 Hoveyda, HRFraser, GLDutheuil, GEl Bousmaqui, MKorac, JLenoir, FLapin, ANoël, S Optimization of Novel Antagonists to the Neurokinin-3 Receptor for the Treatment of Sex-Hormone Disorders (Part II). ACS Med Chem Lett 6:736-40 (2015)  
Target
Name:
Cytochrome P450 2D6
Synonyms:
CP2D6_HUMAN CYP2DL1 Cytochrome P450 2D6 (CYP2D6) P450-DB1
Type:
Protein
Mol. Mass.:
55774.82
Organism:
Homo sapiens (Human)
Description:
P10635
Residue:
497
  
Inhibitor
Name:
BDBM50081195
Synonyms:
CHEMBL3422010 US10683295, Compound 1 US9475814, 1
Type:
Small organic molecule
Emp. Form.:
C21H19N5OS2
Mol. Mass.:
421.538
SMILES:
C[C@H]1N(CCn2c1nnc2-c1csc(C)n1)C(=O)c1ccc(cc1)-c1cccs1
: