Target
Cytochrome P450 2C9
Ligand
BDBM50112181
Substrate
Meas. Tech.
ChEMBL_1512962 (CHEMBL3610075)
IC50
7000±n/a nM
Citation
 Hoveyda, HRFraser, GLDutheuil, GEl Bousmaqui, MKorac, JLenoir, FLapin, ANoël, S Optimization of Novel Antagonists to the Neurokinin-3 Receptor for the Treatment of Sex-Hormone Disorders (Part II). ACS Med Chem Lett 6:736-40 (2015)  
Target
Name:
Cytochrome P450 2C9
Synonyms:
(R)-limonene 6-monooxygenase CP2C9_HUMAN CYP2C9 Cytochrome P450 2C9 (CYP2C9 ) P-450MP P450 PB-1 | S-mephenytoin 4-hydroxylase
Type:
Enzyme
Mol. Mass.:
55636.33
Organism:
Homo sapiens (Human)
Description:
P11712
Residue:
490
  
Inhibitor
Name:
BDBM50112181
Synonyms:
CHEMBL3608687 US10836768, Cpd no 3 US9422299, 3 | US9987274, Compound 3
Type:
Small organic molecule
Emp. Form.:
C16H15ClN6OS
Mol. Mass.:
374.848
SMILES:
C[C@H]1N(CCn2c1nnc2-c1nc(C)ns1)C(=O)c1ccc(Cl)cc1
: