Target
Dual specificity protein phosphatase CDC14A
Ligand
BDBM50112358
Substrate
Meas. Tech.
ChEMBL_1513411 (CHEMBL3611566)
IC50
>50000±n/a nM
Citation
 He, RYu, ZHZhang, RYWu, LGunawan, AMLane, BSShim, JSZeng, LFHe, YChen, LWells, CDLiu, JOZhang, ZY Exploring the Existing Drug Space for Novel pTyr Mimetic and SHP2 Inhibitors. ACS Med Chem Lett 6:782-6 (2015)  
Target
Name:
Dual specificity protein phosphatase CDC14A
Synonyms:
3.1.3.16 CC14A_HUMAN CDC14A
Type:
Mol. Mass.:
66598.40
Organism:
Homo sapiens (Human)
Description:
Q9UNH5
Residue:
594
  
Inhibitor
Name:
BDBM50112358
Synonyms:
CHEMBL3609374
Type:
Small organic molecule
Emp. Form.:
C28H23N3O6S
Mol. Mass.:
529.564
SMILES:
OS(=O)(=O)C(C(=O)Nc1ccc(NC(=O)C(=O)Nc2ccc(cc2)-c2ccccc2)cc1)c1ccccc1
: